{"text_format":"1","workbook":"xlsx","n_sheets":11,"sheets":["Inicial","Instruções","Glossário","Matriz de Risco","Informações","Premissas","Entrada de Dados de Perigo","Pontuação de Dados","Sumário dos Riscos","Relatório de Vulnerabilidade","Contatos"],"not_rendered":{"charts":6,"images":10,"macros":1,"external_links":0,"defined_names":17,"comments":0,"pivot_tables":0},"unopened":[],"bounds":{"document_bytes":16777216,"sheet_cells":100000,"rows_first":2000,"rows_last":500,"rows_between":2000,"halvings":0,"cell_chars":16384,"cell_head_chars":4096},"cells_cut":0,"cells_raw":0,"read":"whole","date_system":"1900"}

{"sheet":"Inicial","index":0,"n_rows":28,"n_cols":13,"rows_kept":28,"cut":false,"hidden":false,"merged":[[27,12,27,16],[27,1,27,5],[27,6,27,10]]}
[]
[]
[]
[]
[]
[]
[null,null,"Ferramenta de Avaliação Rápida de Riscos (ARR)"]
[]
[]
[]
{"$rows_left_out":19}
{"sheet":"Instruções","index":1,"n_rows":196,"n_cols":2,"rows_kept":196,"cut":false,"hidden":false,"merged":[]}
[{"$f":"MdlTle","v":"Ferramenta de Avaliação Rápida de Riscos (ARR)"}]
[{"$f":"MID(CELL(\"filename\",A1),FIND(\"]\",CELL(\"filename\",A1))+1,255)","v":"Instruções"}]
[]
[]
[null,"Uma cidade resiliente é capaz de reduzir, resistir, absorver, acomodar e recuperar-se dos impactos dos perigos de maneira rápida e eficiente, preservando e restaurando estruturas e serviços básicos essenciais."]
[]
[null,"Objetivo da estrutura de tomada de decisão"]
[]
[null,"A ferramenta Estimativa Rápida de Perigos (ARR) foi projetada com o objetivo de identificar e entender os riscos atuais / futuros / estresse / choques e ameaças de exposição a ativos humanos e físicos. A Ferramenta ARR não é uma avaliação de risco completa, mas um processo de engajamento de várias partes interessadas para estabelecer um entendimento comum. Levando em conta as ações ou medidas corretivas já adotadas, o ARR produzirá uma avaliação de risco no estilo de painel, aconselhando os riscos e perigos para os ativos humanos e físicos, os impactos dos principais riscos identificados e os eventos de perigos associados no local especificado e / ou ativo específico ."]
[null,"A ferramenta ARR usa a classificação de perigos descrita pelo Escritório das Nações Unidas para Redução de Riscos de Desastres (UNDRR). Os indicadores de perigo incluídos na ferramenta ARR estão alinhados com os 10 pontos essenciais para tornar o scorecard resiliente das cidades no contexto da estrutura de Sendai para redução de Riscos de desastres 2015-2030 e dos objetivos de desenvolvimento sustentável."]
{"$rows_left_out":187}
{"sheet":"Glossário","index":2,"n_rows":94,"n_cols":16384,"rows_kept":94,"cut":false,"hidden":false,"merged":[[12,1,16,1]]}
[{"$f":"MdlTle","v":"Ferramenta de Avaliação Rápida de Riscos (ARR)"}]
[{"$f":"MID(CELL(\"filename\",A1),FIND(\"]\",CELL(\"filename\",A1))+1,255)","v":"Glossário"}]
[]
[]
[null,"Term","Definition"]
[null,"Ação de Onda","Ondas de superfície geradas pelo vento que podem ocorrer na superfície de qualquer corpo de água aberto, como oceanos, rios e lagos, etc. O tamanho da onda depende da força do vento e da distância percorrida (fetch)."]
[null,"Acidente de Aviação","A ser atualizado"]
[null,"Acidente de Navegação","A ser atualizado"]
[null,"Acidente em estradas","A ser atualizado"]
[null,"Acidente Espacial","A ser atualizado"]
{"$rows_left_out":85}
{"sheet":"Matriz de Risco","index":3,"n_rows":56,"n_cols":9,"rows_kept":56,"cut":false,"hidden":false,"merged":[[25,6,26,6],[25,5,26,5],[25,3,25,4],[8,1,12,1],[25,1,25,2]]}
[{"$f":"MdlTle","v":"Ferramenta de Avaliação Rápida de Riscos (ARR)"}]
[{"$f":"MID(CELL(\"filename\",A1),FIND(\"]\",CELL(\"filename\",A1))+1,255)","v":"Matriz de Risco"}]
[]
[]
[]
[]
[null,"Classificação de probabilidade",null,null,"Muito Baixo","Baixo","Moderado","Alto","Muito Alto"]
[null,"Pontuação da Classificação de probabilidade",null,null,"0 - 2","2 - 4","4 - 6","6 - 8","8 - 10"]
[null,"Gravidade\nPontuação de gravidade média ponderada (com base nas respostas fornecidas para medidas de vulnerabilidade e exposição)","Insignificante","0 - 10","MB1","MB2","B3","B4","M5"]
[null,null,"Menor","11 - 25","MB2","B3","B4","M5","M6"]
{"$rows_left_out":47}
{"sheet":"Informações","index":4,"n_rows":24,"n_cols":3,"rows_kept":24,"cut":false,"hidden":false,"merged":[]}
[{"$f":"MdlTle","v":"Ferramenta de Avaliação Rápida de Riscos (ARR)"}]
[{"$f":"MID(CELL(\"filename\",A1),FIND(\"]\",CELL(\"filename\",A1))+1,255)","v":"Informações"}]
[]
[]
[]
[]
[]
[]
[]
[]
{"$rows_left_out":15}
{"sheet":"Premissas","index":5,"n_rows":162,"n_cols":6,"rows_kept":162,"cut":false,"hidden":false,"merged":[]}
[{"$f":"MdlTle","v":"Ferramenta de Avaliação Rápida de Riscos (ARR)"}]
[{"$f":"MID(CELL(\"filename\",A1),FIND(\"]\",CELL(\"filename\",A1))+1,255)","v":"Premissas"}]
[]
[]
["Premissas gerais"]
[]
[]
[null,"Proporção da pontuação no ranking de probabilidade",null,"%",null,0.5]
[null,"Pontuação máxima",null,"#",null,10]
[null,"Ponderação de vulnerabilidades",null,"%",null,0.25]
{"$rows_left_out":153}
{"sheet":"Entrada de Dados de Perigo","index":6,"n_rows":54,"n_cols":14,"rows_kept":54,"cut":false,"hidden":false,"merged":[[4,1,5,1],[4,4,4,7],[4,2,5,2],[4,13,5,13],[4,3,5,3],[4,9,5,9],[4,12,5,12]]}
[{"$f":"MdlTle","v":"Ferramenta de Avaliação Rápida de Riscos (ARR)"}]
[{"$f":"MID(CELL(\"filename\",A1),FIND(\"]\",CELL(\"filename\",A1))+1,255)","v":"Entrada de Dados de Perigo"}]
[]
[]
[null,"Grupo de Perigo","Subgrupo de Perigo","Classificação de Exposição","Classificação de Vulnerabilidade",null,null,null,"Classificação de Vulnerabilidade Total","Nível atual de medidas de resposta realizadas ou em vigor","Pontuação de classificação de probabilidade","Classificação de Gravidade","Saída da Matriz de Risco","Comentários e Justificativas"]
[null,null,null,null,"Infraestrutura","Setores Produtivos","Serviços Básicos ou Essenciais","Aspectos Humanos e Sociais","1 (baixo) - 100 (alto)",null,"1 (baixo) - 10 (alto)","1 (baixo ) - 100 (alto)"]
[null,"P1 - Geofísico"]
[null,null,null,null,null,null,null,null,{"$f":"IFERROR((((INDEX(Premissas!$F$28:$F$38,MATCH(E8,Vulnerabilties,0))*Premissas!$F$10)+(INDEX(Premissas!$F$28:$F$38,MATCH(F8,Vulnerabilties,0))*Premissas!$F$10)+(INDEX(Premissas!$F$28:$F$38,MATCH(G8,Vulnerabilties,0))*Premissas!$F$10)+(INDEX(Premissas!$F$28:$F$38,MATCH(H8,Vulnerabilties,0))*Premissas!$F$10))*Premissas!$F$9),0)","v":0},null,{"$f":"IFERROR(INDEX(Premissas!$F$15:$F$25,MATCH(D8,Exposures,0)*Premissas!$F$8+(I8/Premissas!$F$9)*Premissas!$F$8),0)","v":0},{"$f":"IFERROR((K8*Premissas!$F$9)-(INDEX(Premissas!$F$41:$F$51,MATCH(J8,Levels_of_response,0))*Premissas!$F$9),0)","v":0},{"$f":"IF(L8<=0,\"MB1\",IFERROR(INDEX('Matriz de Risco'!$G$28:$G$53,MATCH(SUMPRODUCT(('Matriz de Risco'!$B$28:$B$53<=L8)*('Matriz de Risco'!$C$28:$C$53>=L8)*('Matriz de Risco'!$D$28:$D$53<=K8)*('Matriz de Risco'!$E$28:$E$53>=K8)*('Matriz de Risco'!$F$28:$F$53)),'Matriz de Risco'!$F$28:$F$53,0)),0))","v":"MB1"}]
[null,null,null,null,null,null,null,null,{"$f":"IFERROR((((INDEX(Premissas!$F$28:$F$38,MATCH(E9,Vulnerabilties,0))*Premissas!$F$10)+(INDEX(Premissas!$F$28:$F$38,MATCH(F9,Vulnerabilties,0))*Premissas!$F$10)+(INDEX(Premissas!$F$28:$F$38,MATCH(G9,Vulnerabilties,0))*Premissas!$F$10)+(INDEX(Premissas!$F$28:$F$38,MATCH(H9,Vulnerabilties,0))*Premissas!$F$10))*Premissas!$F$9),0)","v":0},null,{"$f":"IFERROR(INDEX(Premissas!$F$15:$F$25,MATCH(D9,Exposures,0)*Premissas!$F$8+(I9/Premissas!$F$9)*Premissas!$F$8),0)","v":0},{"$f":"IFERROR((K9*Premissas!$F$9)-(INDEX(Premissas!$F$41:$F$51,MATCH(J9,Levels_of_response,0))*Premissas!$F$9),0)","v":0},{"$f":"IF(L9<=0,\"MB1\",IFERROR(INDEX('Matriz de Risco'!$G$28:$G$53,MATCH(SUMPRODUCT(('Matriz de Risco'!$B$28:$B$53<=L9)*('Matriz de Risco'!$C$28:$C$53>=L9)*('Matriz de Risco'!$D$28:$D$53<=K9)*('Matriz de Risco'!$E$28:$E$53>=K9)*('Matriz de Risco'!$F$28:$F$53)),'Matriz de Risco'!$F$28:$F$53,0)),0))","v":"MB1"}]
[null,null,null,null,null,null,null,null,{"$f":"IFERROR((((INDEX(Premissas!$F$28:$F$38,MATCH(E10,Vulnerabilties,0))*Premissas!$F$10)+(INDEX(Premissas!$F$28:$F$38,MATCH(F10,Vulnerabilties,0))*Premissas!$F$10)+(INDEX(Premissas!$F$28:$F$38,MATCH(G10,Vulnerabilties,0))*Premissas!$F$10)+(INDEX(Premissas!$F$28:$F$38,MATCH(H10,Vulnerabilties,0))*Premissas!$F$10))*Premissas!$F$9),0)","v":0},null,{"$f":"IFERROR(INDEX(Premissas!$F$15:$F$25,MATCH(D10,Exposures,0)*Premissas!$F$8+(I10/Premissas!$F$9)*Premissas!$F$8),0)","v":0},{"$f":"IFERROR((K10*Premissas!$F$9)-(INDEX(Premissas!$F$41:$F$51,MATCH(J10,Levels_of_response,0))*Premissas!$F$9),0)","v":0},{"$f":"IF(L10<=0,\"MB1\",IFERROR(INDEX('Matriz de Risco'!$G$28:$G$53,MATCH(SUMPRODUCT(('Matriz de Risco'!$B$28:$B$53<=L10)*('Matriz de Risco'!$C$28:$C$53>=L10)*('Matriz de Risco'!$D$28:$D$53<=K10)*('Matriz de Risco'!$E$28:$E$53>=K10)*('Matriz de Risco'!$F$28:$F$53)),'Matriz de Risco'!$F$28:$F$53,0)),0))","v":"MB1"}]
{"$rows_left_out":45}
{"sheet":"Pontuação de Dados","index":7,"n_rows":48,"n_cols":13,"rows_kept":48,"cut":false,"hidden":false,"merged":[[25,1,29,1],[30,1,34,1],[35,1,39,1],[40,1,44,1],[5,0,6,0],[5,1,9,1],[10,1,14,1],[15,1,19,1],[20,1,24,1]]}
[{"$f":"MdlTle","v":"Ferramenta de Avaliação Rápida de Riscos (ARR)"}]
[{"$f":"MID(CELL(\"filename\",A1),FIND(\"]\",CELL(\"filename\",A1))+1,255)","v":"Pontuação de Dados"}]
[]
[]
[null,"Grupo de Perigo","Desastre","Evento de perigo","Classificação de Exposição (1-10)",{"$f":"'Entrada de Dados de Perigo'!E6","v":"Infraestrutura"},{"$f":"'Entrada de Dados de Perigo'!F6","v":"Setores Produtivos"},{"$f":"'Entrada de Dados de Perigo'!G6","v":"Serviços Básicos ou Essenciais"},{"$f":"'Entrada de Dados de Perigo'!H6","v":"Aspectos Humanos e Sociais"},"Classificação de vulnerabilidade Total \n(1-100)","Medidas de Resposta Atuais (1-10)","Pontuação de Classificação de Probabilidade\n(1-10)","Classificação de Gravidade\n(1-100)"]
[null,{"$f":"'Entrada de Dados de Perigo'!$B$7","v":"P1 - Geofísico"},{"$f":"'Entrada de Dados de Perigo'!B8","v":0},{"$f":"'Entrada de Dados de Perigo'!C8","v":0},{"$f":"IFERROR(INDEX(Premissas!$F$15:$F$25,MATCH('Entrada de Dados de Perigo'!D8,Exposures,0)),0)","v":0},{"$f":"IFERROR(INDEX(Premissas!$F$15:$F$25,MATCH('Entrada de Dados de Perigo'!E8,Exposures,0)),0)","v":0},{"$f":"IFERROR(INDEX(Premissas!$F$15:$F$25,MATCH('Entrada de Dados de Perigo'!F8,Exposures,0)),0)","v":0},{"$f":"IFERROR(INDEX(Premissas!$F$15:$F$25,MATCH('Entrada de Dados de Perigo'!G8,Exposures,0)),0)","v":0},{"$f":"IFERROR(INDEX(Premissas!$F$15:$F$25,MATCH('Entrada de Dados de Perigo'!H8,Exposures,0)),0)","v":0},{"$f":"'Entrada de Dados de Perigo'!I8","v":0},{"$f":"IFERROR(INDEX(Premissas!$F$41:$F$51,MATCH('Entrada de Dados de Perigo'!J8,Levels_of_response,0)),0)","v":0},{"$f":"'Entrada de Dados de Perigo'!K8","v":0},{"$f":"'Entrada de Dados de Perigo'!L8","v":0}]
[null,null,{"$f":"'Entrada de Dados de Perigo'!B9","v":0},{"$f":"'Entrada de Dados de Perigo'!C9","v":0},{"$f":"IFERROR(INDEX(Premissas!$F$15:$F$25,MATCH('Entrada de Dados de Perigo'!D9,Exposures,0)),0)","v":0},{"$f":"IFERROR(INDEX(Premissas!$F$15:$F$25,MATCH('Entrada de Dados de Perigo'!E9,Exposures,0)),0)","v":0},{"$f":"IFERROR(INDEX(Premissas!$F$15:$F$25,MATCH('Entrada de Dados de Perigo'!F9,Exposures,0)),0)","v":0},{"$f":"IFERROR(INDEX(Premissas!$F$15:$F$25,MATCH('Entrada de Dados de Perigo'!G9,Exposures,0)),0)","v":0},{"$f":"IFERROR(INDEX(Premissas!$F$15:$F$25,MATCH('Entrada de Dados de Perigo'!H9,Exposures,0)),0)","v":0},{"$f":"'Entrada de Dados de Perigo'!I9","v":0},{"$f":"IFERROR(INDEX(Premissas!$F$41:$F$51,MATCH('Entrada de Dados de Perigo'!J9,Levels_of_response,0)),0)","v":0},{"$f":"'Entrada de Dados de Perigo'!K9","v":0},{"$f":"'Entrada de Dados de Perigo'!L9","v":0}]
[null,null,{"$f":"'Entrada de Dados de Perigo'!B10","v":0},{"$f":"'Entrada de Dados de Perigo'!C10","v":0},{"$f":"IFERROR(INDEX(Premissas!$F$15:$F$25,MATCH('Entrada de Dados de Perigo'!D10,Exposures,0)),0)","v":0},{"$f":"IFERROR(INDEX(Premissas!$F$15:$F$25,MATCH('Entrada de Dados de Perigo'!E10,Exposures,0)),0)","v":0},{"$f":"IFERROR(INDEX(Premissas!$F$15:$F$25,MATCH('Entrada de Dados de Perigo'!F10,Exposures,0)),0)","v":0},{"$f":"IFERROR(INDEX(Premissas!$F$15:$F$25,MATCH('Entrada de Dados de Perigo'!G10,Exposures,0)),0)","v":0},{"$f":"IFERROR(INDEX(Premissas!$F$15:$F$25,MATCH('Entrada de Dados de Perigo'!H10,Exposures,0)),0)","v":0},{"$f":"'Entrada de Dados de Perigo'!I10","v":0},{"$f":"IFERROR(INDEX(Premissas!$F$41:$F$51,MATCH('Entrada de Dados de Perigo'!J10,Levels_of_response,0)),0)","v":0},{"$f":"'Entrada de Dados de Perigo'!K10","v":0},{"$f":"'Entrada de Dados de Perigo'!L10","v":0}]
[null,null,{"$f":"'Entrada de Dados de Perigo'!B11","v":0},{"$f":"'Entrada de Dados de Perigo'!C11","v":0},{"$f":"IFERROR(INDEX(Premissas!$F$15:$F$25,MATCH('Entrada de Dados de Perigo'!D11,Exposures,0)),0)","v":0},{"$f":"IFERROR(INDEX(Premissas!$F$15:$F$25,MATCH('Entrada de Dados de Perigo'!E11,Exposures,0)),0)","v":0},{"$f":"IFERROR(INDEX(Premissas!$F$15:$F$25,MATCH('Entrada de Dados de Perigo'!F11,Exposures,0)),0)","v":0},{"$f":"IFERROR(INDEX(Premissas!$F$15:$F$25,MATCH('Entrada de Dados de Perigo'!G11,Exposures,0)),0)","v":0},{"$f":"IFERROR(INDEX(Premissas!$F$15:$F$25,MATCH('Entrada de Dados de Perigo'!H11,Exposures,0)),0)","v":0},{"$f":"'Entrada de Dados de Perigo'!I11","v":0},{"$f":"IFERROR(INDEX(Premissas!$F$41:$F$51,MATCH('Entrada de Dados de Perigo'!J11,Levels_of_response,0)),0)","v":0},{"$f":"'Entrada de Dados de Perigo'!K11","v":0},{"$f":"'Entrada de Dados de Perigo'!L11","v":0}]
[null,null,{"$f":"'Entrada de Dados de Perigo'!B12","v":0},{"$f":"'Entrada de Dados de Perigo'!C12","v":0},{"$f":"IFERROR(INDEX(Premissas!$F$15:$F$25,MATCH('Entrada de Dados de Perigo'!D12,Exposures,0)),0)","v":0},{"$f":"IFERROR(INDEX(Premissas!$F$15:$F$25,MATCH('Entrada de Dados de Perigo'!E12,Exposures,0)),0)","v":0},{"$f":"IFERROR(INDEX(Premissas!$F$15:$F$25,MATCH('Entrada de Dados de Perigo'!F12,Exposures,0)),0)","v":0},{"$f":"IFERROR(INDEX(Premissas!$F$15:$F$25,MATCH('Entrada de Dados de Perigo'!G12,Exposures,0)),0)","v":0},{"$f":"IFERROR(INDEX(Premissas!$F$15:$F$25,MATCH('Entrada de Dados de Perigo'!H12,Exposures,0)),0)","v":0},{"$f":"'Entrada de Dados de Perigo'!I12","v":0},{"$f":"IFERROR(INDEX(Premissas!$F$41:$F$51,MATCH('Entrada de Dados de Perigo'!J12,Levels_of_response,0)),0)","v":0},{"$f":"'Entrada de Dados de Perigo'!K12","v":0},{"$f":"'Entrada de Dados de Perigo'!L12","v":0}]
{"$rows_left_out":39}
{"sheet":"Sumário dos Riscos","index":8,"n_rows":9,"n_cols":3,"rows_kept":9,"cut":false,"hidden":false,"merged":[]}
[null,{"$f":"MdlTle","v":"Ferramenta de Avaliação Rápida de Riscos (ARR)"}]
[null,{"$f":"MID(CELL(\"filename\",B1),FIND(\"]\",CELL(\"filename\",B1))+1,255)","v":"Sumário dos Riscos"}]
[]
[]
[null,{"$f":"Informações!C15","v":"Local / Região Nome / Título: "},{"$f":"Informações!$L$15","v":0}]
[null,{"$f":"Informações!C17","v":"Descrição: "},{"$f":"Informações!$L$17","v":0}]
[null,{"$f":"Informações!C20","v":"Avaliador (ou seja, pessoa que realizou a análise):"},{"$f":"Informações!$L$20","v":0}]
[null,{"$f":"Informações!C22","v":"Data de conclusão:"},{"$f":"TEXT(Informações!$L$22,\"DD MMM YYYY\")","v":"00 Jan 1900"}]
[null,{"$f":"Informações!C24","v":"Data da Revisão"},{"$f":"TEXT(Informações!$L$24, \"DD MMM YYYY\")","v":"00 Jan 1900"}]

{"sheet":"Relatório de Vulnerabilidade","index":9,"n_rows":55,"n_cols":3,"rows_kept":55,"cut":false,"hidden":false,"merged":[]}
[null,{"$f":"MdlTle","v":"Ferramenta de Avaliação Rápida de Riscos (ARR)"}]
[null,{"$f":"MID(CELL(\"filename\",B1),FIND(\"]\",CELL(\"filename\",B1))+1,255)","v":"Relatório de Vulnerabilidade"}]
[]
[]
[null,{"$f":"Informações!C15","v":"Local / Região Nome / Título: "},{"$f":"Informações!$L$15","v":0}]
[null,{"$f":"Informações!C17","v":"Descrição: "},{"$f":"Informações!$L$17","v":0}]
[null,{"$f":"Informações!C20","v":"Avaliador (ou seja, pessoa que realizou a análise):"},{"$f":"Informações!$L$20","v":0}]
[null,{"$f":"Informações!C22","v":"Data de conclusão:"},{"$f":"TEXT(Informações!$L$22,\"DD MMM YYYY\")","v":"00 Jan 1900"}]
[null,{"$f":"Informações!C24","v":"Data da Revisão"},{"$f":"TEXT(Informações!$L$24, \"DD MMM YYYY\")","v":"00 Jan 1900"}]
[]
{"$rows_left_out":46}
{"sheet":"Contatos","index":10,"n_rows":14,"n_cols":3,"rows_kept":14,"cut":false,"hidden":false,"merged":[[6,0,6,2]]}
[{"$f":"MdlTle","v":"Ferramenta de Avaliação Rápida de Riscos (ARR)"}]
[{"$f":"MID(CELL(\"filename\",A1),FIND(\"]\",CELL(\"filename\",A1))+1,255)","v":"Contatos"}]
[]
[]
[]
["Perguntas?\n\n"]
["Contate nossa equipe e parceiros na região mais próxima de você:"]
[]
["MCR2030 Global Secretariat:",null,"mcr2030-global@un.org"]
["MCR2030 Regional Secretariat for Africa: ",null,"mcr2030-africa@un.org"]
{"$rows_left_out":4}