{"text_format":"1","workbook":"xlsx","n_sheets":10,"sheets":["Нүүр","Заавар","Аюулын нэр томьёоны товч тайлба","Эрсдэлийн матриц","Мэдээлэл","Таамаглал","Эрсдэлийн үнэлгээ","Үнэлгээний оноо","Эрсдэлийн дүн","Эмзэг байдлын тайлан"],"not_rendered":{"charts":6,"images":10,"macros":1,"external_links":0,"defined_names":15,"comments":0,"pivot_tables":0},"unopened":[],"bounds":{"document_bytes":16777216,"sheet_cells":100000,"rows_first":2000,"rows_last":500,"rows_between":2000,"halvings":0,"cell_chars":16384,"cell_head_chars":4096},"cells_cut":0,"cells_raw":0,"read":"whole","date_system":"1900"}

{"sheet":"Нүүр","index":0,"n_rows":7,"n_cols":2,"rows_kept":7,"cut":false,"hidden":false,"merged":[]}
[]
[]
[]
[]
[]
[]
[null,"Гамшгийн эрсдэлийг тооцоолох түргэвчилсэн арга"]

{"sheet":"Заавар","index":1,"n_rows":196,"n_cols":2,"rows_kept":196,"cut":false,"hidden":false,"merged":[]}
[{"$f":"MdlTle","v":"Гамшгийн эрсдэлийг тооцоолох түргэвчилсэн арга"}]
[{"$f":"MID(CELL(\"filename\",A1),FIND(\"]\",CELL(\"filename\",A1))+1,255)","v":"Заавар"}]
[]
[]
[null,"Гамшигт тэсвэртэй хот нь шаардлагатай барилга байгууламж, үйлчилгээг сэргээн босгох замаар түргэн хугацаанд үр дүнтэй байдлаар аюулын нөлөөлийг бууруулах, тэсвэрлэх, сэргээн босгох чадвартай байдаг."]
[]
[null,"Зорилго"]
[]
[null,"Гамшгийн эрсдэлийг тооцоолох түргэвчилсэн арга нь хүн ам, нийгэм, үйлдвэрлэл, дэд бүтцэд учрах өнөөгийн болон болзошгүй эрсдэлийг тодорхойлох, ойлголтыг нэмэгдүүлэх зорилготой. Энэхүү аргаар эрсдэлийг бүх талаас нь үнэлэх боломжгой хэдий ч эрсдэлийн үнэлгээнд оролцогч талуудыг нэгдсэн ойлголтод хүргэж, оролцоог хангахад чиглэнэ. Хүн ам, нийгэм, үйлдвэрлэл, дэд бүтцэд учрах эрсдэлийг тодорхойлох, тодорхойлсон томоохон эрсдэлээс үүсэж болох нөлөөлөл, хор уршиг, өртөх газар нутаг, өртөх зүйлс зэрэг эрсдэлийн үнэлгээний хяналт загварчлалыг гамшгийн эрсдэлийг тооцоолох түргэвчилсэн аргаар тооцон гаргана."]
[null,"НҮБ-ын Гамшгийн эрсдэлийг бууруулах газраас гаргасан аюулын ангиллыг эрсдэлийг тооцоолох түргэвчилсэн аргад ашиглав. Тус аргачлалыг \"Аюулгүй, гамшигт тэсвэртэй хот\" санаачлагын 10 үндсэн чиглэлээр үнэлэх онооны карт болон Гамшгийн эрсдэлийг бууруулах чиглэлээр 2015-2030 онд авч хэрэгжүүлэх Сендайн үйл ажиллагааны хүрээ баримт бичиг, Тогтвортой хөгжлийн зорилттой уялдан боловсруулсан."]
[]
[]
[null,"Энэ аргыг хэн хэрэглэж болох вэ?"]
[]
[]
{"$rows_left_out":182}
{"sheet":"Аюулын нэр томьёоны товч тайлба","index":2,"n_rows":94,"n_cols":16384,"rows_kept":94,"cut":false,"hidden":false,"merged":[[8,1,12,1]]}
[{"$f":"MdlTle","v":"Гамшгийн эрсдэлийг тооцоолох түргэвчилсэн арга"}]
[{"$f":"MID(CELL(\"filename\",A1),FIND(\"]\",CELL(\"filename\",A1))+1,255)","v":"Аюулын нэр томьёоны товч тайлба"}]
[]
[]
[null,"Term","Definition"]
[null,"Агаарын дэлбэрэлт \nAirburst","Газарт чичирхийлэлт үүсгэхгүйгээр дэлхийн агаар мандлын доторхи сүүлт од, метроноридын дэлбэрэлт"]
[null,"Мал, амьтдын осол\nAnimal Incident ","Хүн ам суурьшсан хөдөө, хот суурин газарт аюултай, хэвийн бус байдалтай үрэгдсэн амьтад."]
[null,"Галт уулын үнс\nAsh Fall","Галт уулын дэлбэрэлтийн үеэр 4-өөс бага диаметртэй нягтраагүй галт уулын хаягдал урт хугацааны туршид зайд агаар мандалд тархан оршдог."]
[null,"Нуранги\nAvalanche","Таталцлын хүчний дагуу их хэмжээний цас, мөс болон бусад материал өндөр уулнаас хурдтай гулсан нурж ирэх"]
[]
[null,null,"• Цасны нуранги: Цас, мөс холилдон өндөр уулнаас хурдтай гулсан нурж ирэх "]
[]
[null,null,"• Чулуулаг хэсгийн нуранги: Чулуулаг болон хөрсний жижиг хэсгүүд гэнэтийн маш хурдацтай гулсан нурна. Эдгээр жижиг хэсгүүд нь хүйтэн, халуун гэсэн 2 төрөлтэй. Чулуулаг болон хөрсний хүйтэн жижиг хэсгүүд нь уул хадны тогтоц муутай налуугийн гэнэтийн нуралтаас үүсэх бол халуун жижиг хэсгүүд галт уулын дэлбэрэлтийн нөлөөгөөр үүснэ."]
[null,"Иргэний агаарын тээврийн осол\nAviation Accident","To be updated"]
[null,"Бактерын гаралтай өвчин\nBacterial Disease","Арьс, салст, амьсгалын замын бактераар халдварлах тохиолдол ихээхэн нэмэгдсээр байна. Жишээ нь: салмонела, холер гэх мэт."]
{"$rows_left_out":80}
{"sheet":"Эрсдэлийн матриц","index":3,"n_rows":56,"n_cols":9,"rows_kept":56,"cut":false,"hidden":false,"merged":[[25,6,26,6],[25,5,26,5],[25,3,25,4],[8,1,12,1],[25,1,25,2]]}
[{"$f":"MdlTle","v":"Гамшгийн эрсдэлийг тооцоолох түргэвчилсэн арга"}]
[{"$f":"MID(CELL(\"filename\",A1),FIND(\"]\",CELL(\"filename\",A1))+1,255)","v":"Эрсдэлийн матриц"}]
[]
[]
[]
[]
[null,"Магадлалын зэрэг",null,null,"Маш бага","Бага","Дунд зэрэг","Их","Маш их"]
[null,"Магадлалын зэргийн оноо",null,null,"0 - 2","2 - 4","4 - 6","6 - 8","8 - 10"]
[null,"Хор Уршиг\nХор уршгийн дундаж оноог жинлэж тооцсон (эмзэг байдал, өртөнги, хариу арга хэмжээнд өгсөн хариултад үндэслэв)","Маш бага","0 - 10","МБ1","МБ2","Б3","Б4","ДЗ5"]
[null,null,"Бага","11 - 25","МБ2","Б3","Б4","ДЗ5","ДЗ6"]
[null,null,"Дунд зэрэг","26 - 50","Б3","Б4","ДЗ5","ДЗ6","Ө7"]
[null,null,"Томоохон","51 - 75","Б4","ДЗ5","ДЗ6","Ө7","Ө8"]
[null,null,"Сүйрэл","76 - 100","ДЗ5","ДЗ6","Ө7","Ө8","МӨ9"]
[]
[]
{"$rows_left_out":42}
{"sheet":"Мэдээлэл","index":4,"n_rows":23,"n_cols":3,"rows_kept":23,"cut":false,"hidden":false,"merged":[]}
[{"$f":"MdlTle","v":"Гамшгийн эрсдэлийг тооцоолох түргэвчилсэн арга"}]
[{"$f":"MID(CELL(\"filename\",A1),FIND(\"]\",CELL(\"filename\",A1))+1,255)","v":"Мэдээлэл"}]
[]
[]
[]
[]
[]
[]
[]
[]
[]
[]
[]
[]
[null,null,"Байршил/Аймаг, хотын нэр:"]
{"$rows_left_out":9}
{"sheet":"Таамаглал","index":5,"n_rows":171,"n_cols":6,"rows_kept":171,"cut":false,"hidden":false,"merged":[]}
[{"$f":"MdlTle","v":"Гамшгийн эрсдэлийг тооцоолох түргэвчилсэн арга"}]
[{"$f":"MID(CELL(\"filename\",A1),FIND(\"]\",CELL(\"filename\",A1))+1,255)","v":"Таамаглал"}]
[]
[]
["Ерөнхий таамаглал"]
[]
[]
[null,"Магадлалын зэргийн онооны хувь",null,"%",null,0.5]
[null,"Дээд оноо/зэрэглэл",null,"#",null,10]
[null,"Эмзэг бадлын эзлэх жин",null,"%",null,0.25]
[]
["Зэрэглэл/ оноо"]
[]
[null,"Өртөнгийн зэрэглэл"]
[null,"0% Negligible",null,"#",null,0]
{"$rows_left_out":157}
{"sheet":"Эрсдэлийн үнэлгээ","index":6,"n_rows":54,"n_cols":14,"rows_kept":54,"cut":false,"hidden":false,"merged":[[4,1,5,1],[4,4,4,7],[4,2,5,2],[4,13,5,13],[4,3,5,3],[4,9,5,9],[4,12,5,12]]}
[{"$f":"MdlTle","v":"Гамшгийн эрсдэлийг тооцоолох түргэвчилсэн арга"}]
[{"$f":"MID(CELL(\"filename\",A1),FIND(\"]\",CELL(\"filename\",A1))+1,255)","v":"Эрсдэлийн үнэлгээ"}]
[]
[]
[null,"Аюулын бүлэг/ дэд бүлэг","Аюулт үзэгдэл, осол, хоёрдогч аюул","Өртөнгийн зэрэглэл ","Эмзэг байдлын зэрэглэл",null,null,null,"Эмзэг байдлын зэрэглэл /нийт дүн/","Хариу арга хэмжээний өнөөгийн түвшин, чадавх","Магадлалын зэрэглэлийн оноо","Учрах хор үршгийн зэрэглэл","Эрсдэлийн матрицийн дүн","Тэмдэглэл"]
[null,null,null,null,"Дэд бүтэц","Үйлдвэрлэлийн салбар","Тусгай болон үндсэн хэрэгцээний үйлчилгээ","Хүн ам, нийгмийн байдал","1 (бага) - 100 (их)",null,"1 (бага) - 10 (их)","1 (бага ) - 100 (их)"]
[null,"H1-Геофизикийн гаралтай аюул"]
[null,null,null,null,null,null,null,null,{"$f":"IFERROR((((INDEX(Таамаглал!$F$28:$F$38,MATCH(E8,Vulnerabilties,0))*Таамаглал!$F$10)+(INDEX(Таамаглал!$F$28:$F$38,MATCH(F8,Vulnerabilties,0))*Таамаглал!$F$10)+(INDEX(Таамаглал!$F$28:$F$38,MATCH(G8,Vulnerabilties,0))*Таамаглал!$F$10)+(INDEX(Таамаглал!$F$28:$F$38,MATCH(H8,Vulnerabilties,0))*Таамаглал!$F$10))*Таамаглал!$F$9),0)","v":0},null,{"$f":"IFERROR(INDEX(Таамаглал!$F$15:$F$25,MATCH(D8,Exposures,0)*Таамаглал!$F$8+(I8/Таамаглал!$F$9)*Таамаглал!$F$8),0)","v":0},{"$f":"IFERROR((K8*Таамаглал!$F$9)-(INDEX(Таамаглал!$F$41:$F$51,MATCH(J8,Levels_of_response,0))*Таамаглал!$F$9),0)","v":0},{"$f":"IF(L8=0,\"-\",IFERROR(INDEX('Эрсдэлийн матриц'!$G$28:$G$53,MATCH(SUMPRODUCT(('Эрсдэлийн матриц'!$B$28:$B$53<=L8)*('Эрсдэлийн матриц'!$C$28:$C$53>=L8)*('Эрсдэлийн матриц'!$D$28:$D$53<=K8)*('Эрсдэлийн матриц'!$E$28:$E$53>=K8)*('Эрсдэлийн матриц'!$F$28:$F$53)),'Эрсдэлийн матриц'!$F$28:$F$53,0)),0))","v":"-"}]
[null,null,null,null,null,null,null,null,{"$f":"IFERROR((((INDEX(Таамаглал!$F$28:$F$38,MATCH(E9,Vulnerabilties,0))*Таамаглал!$F$10)+(INDEX(Таамаглал!$F$28:$F$38,MATCH(F9,Vulnerabilties,0))*Таамаглал!$F$10)+(INDEX(Таамаглал!$F$28:$F$38,MATCH(G9,Vulnerabilties,0))*Таамаглал!$F$10)+(INDEX(Таамаглал!$F$28:$F$38,MATCH(H9,Vulnerabilties,0))*Таамаглал!$F$10))*Таамаглал!$F$9),0)","v":0},null,{"$f":"IFERROR(INDEX(Таамаглал!$F$15:$F$25,MATCH(D9,Exposures,0)*Таамаглал!$F$8+(I9/Таамаглал!$F$9)*Таамаглал!$F$8),0)","v":0},{"$f":"IFERROR((K9*Таамаглал!$F$9)-(INDEX(Таамаглал!$F$41:$F$51,MATCH(J9,Levels_of_response,0))*Таамаглал!$F$9),0)","v":0},{"$f":"IF(L9=0,\"-\",IFERROR(INDEX('Эрсдэлийн матриц'!$G$28:$G$53,MATCH(SUMPRODUCT(('Эрсдэлийн матриц'!$B$28:$B$53<=L9)*('Эрсдэлийн матриц'!$C$28:$C$53>=L9)*('Эрсдэлийн матриц'!$D$28:$D$53<=K9)*('Эрсдэлийн матриц'!$E$28:$E$53>=K9)*('Эрсдэлийн матриц'!$F$28:$F$53)),'Эрсдэлийн матриц'!$F$28:$F$53,0)),0))","v":"-"}]
[null,null,null,null,null,null,null,null,{"$f":"IFERROR((((INDEX(Таамаглал!$F$28:$F$38,MATCH(E10,Vulnerabilties,0))*Таамаглал!$F$10)+(INDEX(Таамаглал!$F$28:$F$38,MATCH(F10,Vulnerabilties,0))*Таамаглал!$F$10)+(INDEX(Таамаглал!$F$28:$F$38,MATCH(G10,Vulnerabilties,0))*Таамаглал!$F$10)+(INDEX(Таамаглал!$F$28:$F$38,MATCH(H10,Vulnerabilties,0))*Таамаглал!$F$10))*Таамаглал!$F$9),0)","v":0},null,{"$f":"IFERROR(INDEX(Таамаглал!$F$15:$F$25,MATCH(D10,Exposures,0)*Таамаглал!$F$8+(I10/Таамаглал!$F$9)*Таамаглал!$F$8),0)","v":0},{"$f":"IFERROR((K10*Таамаглал!$F$9)-(INDEX(Таамаглал!$F$41:$F$51,MATCH(J10,Levels_of_response,0))*Таамаглал!$F$9),0)","v":0},{"$f":"IF(L10=0,\"-\",IFERROR(INDEX('Эрсдэлийн матриц'!$G$28:$G$53,MATCH(SUMPRODUCT(('Эрсдэлийн матриц'!$B$28:$B$53<=L10)*('Эрсдэлийн матриц'!$C$28:$C$53>=L10)*('Эрсдэлийн матриц'!$D$28:$D$53<=K10)*('Эрсдэлийн матриц'!$E$28:$E$53>=K10)*('Эрсдэлийн матриц'!$F$28:$F$53)),'Эрсдэлийн матриц'!$F$28:$F$53,0)),0))","v":"-"}]
[null,null,null,null,null,null,null,null,{"$f":"IFERROR((((INDEX(Таамаглал!$F$28:$F$38,MATCH(E11,Vulnerabilties,0))*Таамаглал!$F$10)+(INDEX(Таамаглал!$F$28:$F$38,MATCH(F11,Vulnerabilties,0))*Таамаглал!$F$10)+(INDEX(Таамаглал!$F$28:$F$38,MATCH(G11,Vulnerabilties,0))*Таамаглал!$F$10)+(INDEX(Таамаглал!$F$28:$F$38,MATCH(H11,Vulnerabilties,0))*Таамаглал!$F$10))*Таамаглал!$F$9),0)","v":0},null,{"$f":"IFERROR(INDEX(Таамаглал!$F$15:$F$25,MATCH(D11,Exposures,0)*Таамаглал!$F$8+(I11/Таамаглал!$F$9)*Таамаглал!$F$8),0)","v":0},{"$f":"IFERROR((K11*Таамаглал!$F$9)-(INDEX(Таамаглал!$F$41:$F$51,MATCH(J11,Levels_of_response,0))*Таамаглал!$F$9),0)","v":0},{"$f":"IF(L11=0,\"-\",IFERROR(INDEX('Эрсдэлийн матриц'!$G$28:$G$53,MATCH(SUMPRODUCT(('Эрсдэлийн матриц'!$B$28:$B$53<=L11)*('Эрсдэлийн матриц'!$C$28:$C$53>=L11)*('Эрсдэлийн матриц'!$D$28:$D$53<=K11)*('Эрсдэлийн матриц'!$E$28:$E$53>=K11)*('Эрсдэлийн матриц'!$F$28:$F$53)),'Эрсдэлийн матриц'!$F$28:$F$53,0)),0))","v":"-"}]
[null,null,null,null,null,null,null,null,{"$f":"IFERROR((((INDEX(Таамаглал!$F$28:$F$38,MATCH(E12,Vulnerabilties,0))*Таамаглал!$F$10)+(INDEX(Таамаглал!$F$28:$F$38,MATCH(F12,Vulnerabilties,0))*Таамаглал!$F$10)+(INDEX(Таамаглал!$F$28:$F$38,MATCH(G12,Vulnerabilties,0))*Таамаглал!$F$10)+(INDEX(Таамаглал!$F$28:$F$38,MATCH(H12,Vulnerabilties,0))*Таамаглал!$F$10))*Таамаглал!$F$9),0)","v":0},null,{"$f":"IFERROR(INDEX(Таамаглал!$F$15:$F$25,MATCH(D12,Exposures,0)*Таамаглал!$F$8+(I12/Таамаглал!$F$9)*Таамаглал!$F$8),0)","v":0},{"$f":"IFERROR((K12*Таамаглал!$F$9)-(INDEX(Таамаглал!$F$41:$F$51,MATCH(J12,Levels_of_response,0))*Таамаглал!$F$9),0)","v":0},{"$f":"IF(L12=0,\"-\",IFERROR(INDEX('Эрсдэлийн матриц'!$G$28:$G$53,MATCH(SUMPRODUCT(('Эрсдэлийн матриц'!$B$28:$B$53<=L12)*('Эрсдэлийн матриц'!$C$28:$C$53>=L12)*('Эрсдэлийн матриц'!$D$28:$D$53<=K12)*('Эрсдэлийн матриц'!$E$28:$E$53>=K12)*('Эрсдэлийн матриц'!$F$28:$F$53)),'Эрсдэлийн матриц'!$F$28:$F$53,0)),0))","v":"-"}]
[null,"H2-Ус зүйн гаралтай аюул"]
[null,null,null,null,null,null,null,null,null,null,null,null,{"$f":"IF(L14=0,\"-\",IFERROR(INDEX('Эрсдэлийн матриц'!$G$28:$G$53,MATCH(SUMPRODUCT(('Эрсдэлийн матриц'!$B$28:$B$53<=L14)*('Эрсдэлийн матриц'!$C$28:$C$53>=L14)*('Эрсдэлийн матриц'!$D$28:$D$53<=K14)*('Эрсдэлийн матриц'!$E$28:$E$53>=K14)*('Эрсдэлийн матриц'!$F$28:$F$53)),'Эрсдэлийн матриц'!$F$28:$F$53,0)),0))","v":"-"}]
[null,null,null,null,null,null,null,null,{"$f":"IFERROR((((INDEX(Таамаглал!$F$28:$F$38,MATCH(E15,Vulnerabilties,0))*Таамаглал!$F$10)+(INDEX(Таамаглал!$F$28:$F$38,MATCH(F15,Vulnerabilties,0))*Таамаглал!$F$10)+(INDEX(Таамаглал!$F$28:$F$38,MATCH(G15,Vulnerabilties,0))*Таамаглал!$F$10)+(INDEX(Таамаглал!$F$28:$F$38,MATCH(H15,Vulnerabilties,0))*Таамаглал!$F$10))*Таамаглал!$F$9),0)","v":0},null,{"$f":"IFERROR(INDEX(Таамаглал!$F$15:$F$25,MATCH(D15,Exposures,0)*Таамаглал!$F$8+(I15/Таамаглал!$F$9)*Таамаглал!$F$8),0)","v":0},{"$f":"IFERROR((K15*Таамаглал!$F$9)-(INDEX(Таамаглал!$F$41:$F$51,MATCH(J15,Levels_of_response,0))*Таамаглал!$F$9),0)","v":0},{"$f":"IF(L15=0,\"-\",IFERROR(INDEX('Эрсдэлийн матриц'!$G$28:$G$53,MATCH(SUMPRODUCT(('Эрсдэлийн матриц'!$B$28:$B$53<=L15)*('Эрсдэлийн матриц'!$C$28:$C$53>=L15)*('Эрсдэлийн матриц'!$D$28:$D$53<=K15)*('Эрсдэлийн матриц'!$E$28:$E$53>=K15)*('Эрсдэлийн матриц'!$F$28:$F$53)),'Эрсдэлийн матриц'!$F$28:$F$53,0)),0))","v":"-"}]
{"$rows_left_out":40}
{"sheet":"Үнэлгээний оноо","index":7,"n_rows":48,"n_cols":13,"rows_kept":48,"cut":false,"hidden":false,"merged":[[25,1,29,1],[30,1,34,1],[35,1,39,1],[40,1,44,1],[5,0,6,0],[5,1,9,1],[10,1,14,1],[15,1,19,1],[20,1,24,1]]}
[{"$f":"MdlTle","v":"Гамшгийн эрсдэлийг тооцоолох түргэвчилсэн арга"}]
[{"$f":"MID(CELL(\"filename\",A1),FIND(\"]\",CELL(\"filename\",A1))+1,255)","v":"Үнэлгээний оноо"}]
[]
[]
[null,"Аюулын бүлэг/ дэд бүлэг","Гамшиг","Үүсэх аюулт үзэгдэл осол","Өртөнгийн зэрэглэл (1-10)",{"$f":"'Эрсдэлийн үнэлгээ'!E6","v":"Дэд бүтэц"},{"$f":"'Эрсдэлийн үнэлгээ'!F6","v":"Үйлдвэрлэлийн салбар"},{"$f":"'Эрсдэлийн үнэлгээ'!G6","v":"Тусгай болон үндсэн хэрэгцээний үйлчилгээ"},{"$f":"'Эрсдэлийн үнэлгээ'!H6","v":"Хүн ам, нийгмийн байдал"},"Нийт дүн - Эмзэг байдлын зэрэглэл\n(1-100)","Хариу арга хэмжээний өнөөгийн түвшин, чадавх      (1-10)","Магадлалын зэрэглэлийн оноо \n(1-10)","Учрах хор уршгийн зэрэглэл \n(1-100)"]
[null,{"$f":"'Эрсдэлийн үнэлгээ'!$B$7","v":"H1-Геофизикийн гаралтай аюул"},{"$f":"'Эрсдэлийн үнэлгээ'!B8","v":0},{"$f":"'Эрсдэлийн үнэлгээ'!C8","v":0},{"$f":"IFERROR(INDEX(Таамаглал!$F$15:$F$25,MATCH('Эрсдэлийн үнэлгээ'!D8,Exposures,0)),0)","v":0},{"$f":"IFERROR(INDEX(Таамаглал!$F$15:$F$25,MATCH('Эрсдэлийн үнэлгээ'!E8,Exposures,0)),0)","v":0},{"$f":"IFERROR(INDEX(Таамаглал!$F$15:$F$25,MATCH('Эрсдэлийн үнэлгээ'!F8,Exposures,0)),0)","v":0},{"$f":"IFERROR(INDEX(Таамаглал!$F$15:$F$25,MATCH('Эрсдэлийн үнэлгээ'!G8,Exposures,0)),0)","v":0},{"$f":"IFERROR(INDEX(Таамаглал!$F$15:$F$25,MATCH('Эрсдэлийн үнэлгээ'!H8,Exposures,0)),0)","v":0},{"$f":"'Эрсдэлийн үнэлгээ'!I8","v":0},{"$f":"IFERROR(INDEX(Таамаглал!$F$41:$F$51,MATCH('Эрсдэлийн үнэлгээ'!J8,Levels_of_response,0)),0)","v":0},{"$f":"'Эрсдэлийн үнэлгээ'!K8","v":0},{"$f":"'Эрсдэлийн үнэлгээ'!L8","v":0}]
[null,null,{"$f":"'Эрсдэлийн үнэлгээ'!B9","v":0},{"$f":"'Эрсдэлийн үнэлгээ'!C9","v":0},{"$f":"IFERROR(INDEX(Таамаглал!$F$15:$F$25,MATCH('Эрсдэлийн үнэлгээ'!D9,Exposures,0)),0)","v":0},{"$f":"IFERROR(INDEX(Таамаглал!$F$15:$F$25,MATCH('Эрсдэлийн үнэлгээ'!E9,Exposures,0)),0)","v":0},{"$f":"IFERROR(INDEX(Таамаглал!$F$15:$F$25,MATCH('Эрсдэлийн үнэлгээ'!F9,Exposures,0)),0)","v":0},{"$f":"IFERROR(INDEX(Таамаглал!$F$15:$F$25,MATCH('Эрсдэлийн үнэлгээ'!G9,Exposures,0)),0)","v":0},{"$f":"IFERROR(INDEX(Таамаглал!$F$15:$F$25,MATCH('Эрсдэлийн үнэлгээ'!H9,Exposures,0)),0)","v":0},{"$f":"'Эрсдэлийн үнэлгээ'!I9","v":0},{"$f":"IFERROR(INDEX(Таамаглал!$F$41:$F$51,MATCH('Эрсдэлийн үнэлгээ'!J9,Levels_of_response,0)),0)","v":0},{"$f":"'Эрсдэлийн үнэлгээ'!K9","v":0},{"$f":"'Эрсдэлийн үнэлгээ'!L9","v":0}]
[null,null,{"$f":"'Эрсдэлийн үнэлгээ'!B10","v":0},{"$f":"'Эрсдэлийн үнэлгээ'!C10","v":0},{"$f":"IFERROR(INDEX(Таамаглал!$F$15:$F$25,MATCH('Эрсдэлийн үнэлгээ'!D10,Exposures,0)),0)","v":0},{"$f":"IFERROR(INDEX(Таамаглал!$F$15:$F$25,MATCH('Эрсдэлийн үнэлгээ'!E10,Exposures,0)),0)","v":0},{"$f":"IFERROR(INDEX(Таамаглал!$F$15:$F$25,MATCH('Эрсдэлийн үнэлгээ'!F10,Exposures,0)),0)","v":0},{"$f":"IFERROR(INDEX(Таамаглал!$F$15:$F$25,MATCH('Эрсдэлийн үнэлгээ'!G10,Exposures,0)),0)","v":0},{"$f":"IFERROR(INDEX(Таамаглал!$F$15:$F$25,MATCH('Эрсдэлийн үнэлгээ'!H10,Exposures,0)),0)","v":0},{"$f":"'Эрсдэлийн үнэлгээ'!I10","v":0},{"$f":"IFERROR(INDEX(Таамаглал!$F$41:$F$51,MATCH('Эрсдэлийн үнэлгээ'!J10,Levels_of_response,0)),0)","v":0},{"$f":"'Эрсдэлийн үнэлгээ'!K10","v":0},{"$f":"'Эрсдэлийн үнэлгээ'!L10","v":0}]
[null,null,{"$f":"'Эрсдэлийн үнэлгээ'!B11","v":0},{"$f":"'Эрсдэлийн үнэлгээ'!C11","v":0},{"$f":"IFERROR(INDEX(Таамаглал!$F$15:$F$25,MATCH('Эрсдэлийн үнэлгээ'!D11,Exposures,0)),0)","v":0},{"$f":"IFERROR(INDEX(Таамаглал!$F$15:$F$25,MATCH('Эрсдэлийн үнэлгээ'!E11,Exposures,0)),0)","v":0},{"$f":"IFERROR(INDEX(Таамаглал!$F$15:$F$25,MATCH('Эрсдэлийн үнэлгээ'!F11,Exposures,0)),0)","v":0},{"$f":"IFERROR(INDEX(Таамаглал!$F$15:$F$25,MATCH('Эрсдэлийн үнэлгээ'!G11,Exposures,0)),0)","v":0},{"$f":"IFERROR(INDEX(Таамаглал!$F$15:$F$25,MATCH('Эрсдэлийн үнэлгээ'!H11,Exposures,0)),0)","v":0},{"$f":"'Эрсдэлийн үнэлгээ'!I11","v":0},{"$f":"IFERROR(INDEX(Таамаглал!$F$41:$F$51,MATCH('Эрсдэлийн үнэлгээ'!J11,Levels_of_response,0)),0)","v":0},{"$f":"'Эрсдэлийн үнэлгээ'!K11","v":0},{"$f":"'Эрсдэлийн үнэлгээ'!L11","v":0}]
[null,null,{"$f":"'Эрсдэлийн үнэлгээ'!B12","v":0},{"$f":"'Эрсдэлийн үнэлгээ'!C12","v":0},{"$f":"IFERROR(INDEX(Таамаглал!$F$15:$F$25,MATCH('Эрсдэлийн үнэлгээ'!D12,Exposures,0)),0)","v":0},{"$f":"IFERROR(INDEX(Таамаглал!$F$15:$F$25,MATCH('Эрсдэлийн үнэлгээ'!E12,Exposures,0)),0)","v":0},{"$f":"IFERROR(INDEX(Таамаглал!$F$15:$F$25,MATCH('Эрсдэлийн үнэлгээ'!F12,Exposures,0)),0)","v":0},{"$f":"IFERROR(INDEX(Таамаглал!$F$15:$F$25,MATCH('Эрсдэлийн үнэлгээ'!G12,Exposures,0)),0)","v":0},{"$f":"IFERROR(INDEX(Таамаглал!$F$15:$F$25,MATCH('Эрсдэлийн үнэлгээ'!H12,Exposures,0)),0)","v":0},{"$f":"'Эрсдэлийн үнэлгээ'!I12","v":0},{"$f":"IFERROR(INDEX(Таамаглал!$F$41:$F$51,MATCH('Эрсдэлийн үнэлгээ'!J12,Levels_of_response,0)),0)","v":0},{"$f":"'Эрсдэлийн үнэлгээ'!K12","v":0},{"$f":"'Эрсдэлийн үнэлгээ'!L12","v":0}]
[null,{"$f":"'Эрсдэлийн үнэлгээ'!$B$13","v":"H2-Ус зүйн гаралтай аюул"},null,{"$f":"'Эрсдэлийн үнэлгээ'!C14","v":0},{"$f":"IFERROR(INDEX(Таамаглал!$F$15:$F$25,MATCH('Эрсдэлийн үнэлгээ'!D14,Exposures,0)),0)","v":0},{"$f":"IFERROR(INDEX(Таамаглал!$F$15:$F$25,MATCH('Эрсдэлийн үнэлгээ'!E14,Exposures,0)),0)","v":0},{"$f":"IFERROR(INDEX(Таамаглал!$F$15:$F$25,MATCH('Эрсдэлийн үнэлгээ'!F14,Exposures,0)),0)","v":0},{"$f":"IFERROR(INDEX(Таамаглал!$F$15:$F$25,MATCH('Эрсдэлийн үнэлгээ'!G14,Exposures,0)),0)","v":0},{"$f":"IFERROR(INDEX(Таамаглал!$F$15:$F$25,MATCH('Эрсдэлийн үнэлгээ'!H14,Exposures,0)),0)","v":0},{"$f":"'Эрсдэлийн үнэлгээ'!I14","v":0},{"$f":"IFERROR(INDEX(Таамаглал!$F$41:$F$51,MATCH('Эрсдэлийн үнэлгээ'!J14,Levels_of_response,0)),0)","v":0},{"$f":"'Эрсдэлийн үнэлгээ'!K14","v":0},{"$f":"'Эрсдэлийн үнэлгээ'!L14","v":0}]
[null,null,null,{"$f":"'Эрсдэлийн үнэлгээ'!C15","v":0},{"$f":"IFERROR(INDEX(Таамаглал!$F$15:$F$25,MATCH('Эрсдэлийн үнэлгээ'!D15,Exposures,0)),0)","v":0},{"$f":"IFERROR(INDEX(Таамаглал!$F$15:$F$25,MATCH('Эрсдэлийн үнэлгээ'!E15,Exposures,0)),0)","v":0},{"$f":"IFERROR(INDEX(Таамаглал!$F$15:$F$25,MATCH('Эрсдэлийн үнэлгээ'!F15,Exposures,0)),0)","v":0},{"$f":"IFERROR(INDEX(Таамаглал!$F$15:$F$25,MATCH('Эрсдэлийн үнэлгээ'!G15,Exposures,0)),0)","v":0},{"$f":"IFERROR(INDEX(Таамаглал!$F$15:$F$25,MATCH('Эрсдэлийн үнэлгээ'!H15,Exposures,0)),0)","v":0},{"$f":"'Эрсдэлийн үнэлгээ'!I15","v":0},{"$f":"IFERROR(INDEX(Таамаглал!$F$41:$F$51,MATCH('Эрсдэлийн үнэлгээ'!J15,Levels_of_response,0)),0)","v":0},{"$f":"'Эрсдэлийн үнэлгээ'!K15","v":0},{"$f":"'Эрсдэлийн үнэлгээ'!L15","v":0}]
[null,null,null,{"$f":"'Эрсдэлийн үнэлгээ'!C16","v":0},{"$f":"IFERROR(INDEX(Таамаглал!$F$15:$F$25,MATCH('Эрсдэлийн үнэлгээ'!D16,Exposures,0)),0)","v":0},{"$f":"IFERROR(INDEX(Таамаглал!$F$15:$F$25,MATCH('Эрсдэлийн үнэлгээ'!E16,Exposures,0)),0)","v":0},{"$f":"IFERROR(INDEX(Таамаглал!$F$15:$F$25,MATCH('Эрсдэлийн үнэлгээ'!F16,Exposures,0)),0)","v":0},{"$f":"IFERROR(INDEX(Таамаглал!$F$15:$F$25,MATCH('Эрсдэлийн үнэлгээ'!G16,Exposures,0)),0)","v":0},{"$f":"IFERROR(INDEX(Таамаглал!$F$15:$F$25,MATCH('Эрсдэлийн үнэлгээ'!H16,Exposures,0)),0)","v":0},{"$f":"'Эрсдэлийн үнэлгээ'!I16","v":0},{"$f":"IFERROR(INDEX(Таамаглал!$F$41:$F$51,MATCH('Эрсдэлийн үнэлгээ'!J16,Levels_of_response,0)),0)","v":0},{"$f":"'Эрсдэлийн үнэлгээ'!K16","v":0},{"$f":"'Эрсдэлийн үнэлгээ'!L16","v":0}]
[null,null,null,{"$f":"'Эрсдэлийн үнэлгээ'!C17","v":0},{"$f":"IFERROR(INDEX(Таамаглал!$F$15:$F$25,MATCH('Эрсдэлийн үнэлгээ'!D17,Exposures,0)),0)","v":0},{"$f":"IFERROR(INDEX(Таамаглал!$F$15:$F$25,MATCH('Эрсдэлийн үнэлгээ'!E17,Exposures,0)),0)","v":0},{"$f":"IFERROR(INDEX(Таамаглал!$F$15:$F$25,MATCH('Эрсдэлийн үнэлгээ'!F17,Exposures,0)),0)","v":0},{"$f":"IFERROR(INDEX(Таамаглал!$F$15:$F$25,MATCH('Эрсдэлийн үнэлгээ'!G17,Exposures,0)),0)","v":0},{"$f":"IFERROR(INDEX(Таамаглал!$F$15:$F$25,MATCH('Эрсдэлийн үнэлгээ'!H17,Exposures,0)),0)","v":0},{"$f":"'Эрсдэлийн үнэлгээ'!I17","v":0},{"$f":"IFERROR(INDEX(Таамаглал!$F$41:$F$51,MATCH('Эрсдэлийн үнэлгээ'!J17,Levels_of_response,0)),0)","v":0},{"$f":"'Эрсдэлийн үнэлгээ'!K17","v":0},{"$f":"'Эрсдэлийн үнэлгээ'!L17","v":0}]
[null,null,null,{"$f":"'Эрсдэлийн үнэлгээ'!C18","v":0},{"$f":"IFERROR(INDEX(Таамаглал!$F$15:$F$25,MATCH('Эрсдэлийн үнэлгээ'!D18,Exposures,0)),0)","v":0},{"$f":"IFERROR(INDEX(Таамаглал!$F$15:$F$25,MATCH('Эрсдэлийн үнэлгээ'!E18,Exposures,0)),0)","v":0},{"$f":"IFERROR(INDEX(Таамаглал!$F$15:$F$25,MATCH('Эрсдэлийн үнэлгээ'!F18,Exposures,0)),0)","v":0},{"$f":"IFERROR(INDEX(Таамаглал!$F$15:$F$25,MATCH('Эрсдэлийн үнэлгээ'!G18,Exposures,0)),0)","v":0},{"$f":"IFERROR(INDEX(Таамаглал!$F$15:$F$25,MATCH('Эрсдэлийн үнэлгээ'!H18,Exposures,0)),0)","v":0},{"$f":"'Эрсдэлийн үнэлгээ'!I18","v":0},{"$f":"IFERROR(INDEX(Таамаглал!$F$41:$F$51,MATCH('Эрсдэлийн үнэлгээ'!J18,Levels_of_response,0)),0)","v":0},{"$f":"'Эрсдэлийн үнэлгээ'!K18","v":0},{"$f":"'Эрсдэлийн үнэлгээ'!L18","v":0}]
{"$rows_left_out":34}
{"sheet":"Эрсдэлийн дүн","index":8,"n_rows":9,"n_cols":3,"rows_kept":9,"cut":false,"hidden":false,"merged":[]}
[null,{"$f":"MdlTle","v":"Гамшгийн эрсдэлийг тооцоолох түргэвчилсэн арга"}]
[null,{"$f":"MID(CELL(\"filename\",B1),FIND(\"]\",CELL(\"filename\",B1))+1,255)","v":"Эрсдэлийн дүн"}]
[]
[]
[null,{"$f":"Мэдээлэл!C15","v":"Байршил/Аймаг, хотын нэр:"},{"$f":"Мэдээлэл!$L$15","v":0}]
[null,{"$f":"Мэдээлэл!C17","v":"Үнэлгээ хийж буй газрын нэр (сум, дүүрэг, баг, хороо):"},{"$f":"Мэдээлэл!$L$17","v":0}]
[null,{"$f":"Мэдээлэл!C19","v":"Үнэлгээний ажлыг удирдаж гүйцэтгэсэн:"},{"$f":"Мэдээлэл!$L$19","v":0}]
[null,{"$f":"Мэдээлэл!C21","v":"Үнэлгээ гүйцэтгэсэн огноо:"}]
[null,{"$f":"Мэдээлэл!C23","v":"Давтан үнэлгээ хийх огноо:"}]

{"sheet":"Эмзэг байдлын тайлан","index":9,"n_rows":55,"n_cols":3,"rows_kept":55,"cut":false,"hidden":false,"merged":[]}
[null,{"$f":"MdlTle","v":"Гамшгийн эрсдэлийг тооцоолох түргэвчилсэн арга"}]
[null,{"$f":"MID(CELL(\"filename\",B1),FIND(\"]\",CELL(\"filename\",B1))+1,255)","v":"Эмзэг байдлын тайлан"}]
[]
[]
[null,{"$f":"Мэдээлэл!C15","v":"Байршил/Аймаг, хотын нэр:"},{"$f":"Мэдээлэл!$L$15","v":0}]
[null,{"$f":"Мэдээлэл!C17","v":"Үнэлгээ хийж буй газрын нэр (сум, дүүрэг, баг, хороо):"},{"$f":"Мэдээлэл!$L$17","v":0}]
[null,{"$f":"Мэдээлэл!C19","v":"Үнэлгээний ажлыг удирдаж гүйцэтгэсэн:"},{"$f":"Мэдээлэл!$L$19","v":0}]
[null,{"$f":"Мэдээлэл!C21","v":"Үнэлгээ гүйцэтгэсэн огноо:"}]
[null,{"$f":"Мэдээлэл!C23","v":"Давтан үнэлгээ хийх огноо:"}]
[]
[]
[]
[]
[]
[]
{"$rows_left_out":40}