{"text_format":"1","workbook":"xlsx","n_sheets":11,"sheets":["Обложка","Инструкции","Глоссарий угроз","Матрица рисков","Информация","Предположения","Ввод данных об угрозах","Оценка данных","Отчет о рисках","Отчет об уязвимости","Контакты"],"not_rendered":{"charts":6,"images":13,"macros":1,"external_links":0,"defined_names":15,"comments":0,"pivot_tables":0},"unopened":[],"bounds":{"document_bytes":16777216,"sheet_cells":100000,"rows_first":2000,"rows_last":500,"rows_between":2000,"halvings":0,"cell_chars":16384,"cell_head_chars":4096},"cells_cut":0,"cells_raw":0,"read":"whole","date_system":"1900"}

{"sheet":"Обложка","index":0,"n_rows":28,"n_cols":13,"rows_kept":28,"cut":false,"hidden":false,"merged":[[27,12,27,16]]}
[]
[]
[]
[]
[]
[]
[null,null,"Инструмент быстрой оценки риска (БОР)"]
[]
[]
[]
{"$rows_left_out":19}
{"sheet":"Инструкции","index":1,"n_rows":196,"n_cols":2,"rows_kept":196,"cut":false,"hidden":false,"merged":[]}
[{"$f":"MdlTle","v":"Инструмент быстрой оценки риска (БОР)"}]
[{"$f":"MID(CELL(\"filename\",A1),FIND(\"]\",CELL(\"filename\",A1))+1,255)","v":"Инструкции"}]
[]
[]
[null,"Устойчивый город - это тот город, который способен быстро и эффективно снижать, сопротивляться, поглощать, приспосабливаться и восстанавливаться после воздействия угроз, сохраняя и восстанавливая основные базовые структуры и услуги."]
[]
[null,"Цель структуры принятия решений"]
[]
[null,"Инструмент быстрой оценки риска (БОР) был разработан с целью выявления и понимания текущих и будущих рисков / стрессов / ударов и угроз воздействия как на людей, так и на физическое имущество. Инструмент БОР не является полномасштабной оценкой рисков, а скорее процессом взаимодействия с несколькими заинтересованными сторонами для установления общего понимания. Принимая во внимание уже предпринятые действия или корректирующие меры, БОР будет проводить оценку риска в стиле панели управления, в которой сообщается о рисках и опасностях для людей и имущества, воздействии выявленных основных рисков и связанных с ними опасностей в указанном месте и / или конкретном объекте."]
[null,"Инструмент БОР использует классификацию угроз, изложенную Бюро ООН по снижению риска бедствий (БСРБ ООН). Показатели угроз, включенные в инструмент БОР, приведены в соответствие с 10 Основными принципами для создания устойчивой системы показателей городов в контексте Сэндайской рамочной программы по снижению риска  бедствий 2015-2030 и целей устойчивого развития."]
{"$rows_left_out":187}
{"sheet":"Глоссарий угроз","index":2,"n_rows":94,"n_cols":16384,"rows_kept":94,"cut":false,"hidden":false,"merged":[[8,1,12,1]]}
[{"$f":"MdlTle","v":"Инструмент быстрой оценки риска (БОР)"}]
[{"$f":"MID(CELL(\"filename\",A1),FIND(\"]\",CELL(\"filename\",A1))+1,255)","v":"Глоссарий угроз"}]
[]
[]
[null,"Term","Definition"]
[null,"Взрыв в воздухе","Взрыв кометы или метеорного тела в атмосфере земли без удара по земле."]
[null,"Инцидент с животными","Человеческие встречи с опасными или экзотическими животными как в городской, так и в сельской местности."]
[null,"Падение пепла","Мелкий (менее 4 мм в диаметре) неуплотненный вулканический мусор, унесенный в атмосферу во время извержения; Может оставаться в воздухе в течение длительных периодов времени и перемещаться на значительное расстояние от источника."]
[null,"Лавина","Большая масса разрыхленного земного материала, снега или льда, который скользит, течет или падает быстро вниз по склону горы под действием силы тяжести."]
[]
{"$rows_left_out":85}
{"sheet":"Матрица рисков","index":3,"n_rows":56,"n_cols":9,"rows_kept":56,"cut":false,"hidden":false,"merged":[[25,6,26,6],[25,5,26,5],[25,3,25,4],[8,1,12,1],[25,1,25,2]]}
[{"$f":"MdlTle","v":"Инструмент быстрой оценки риска (БОР)"}]
[{"$f":"MID(CELL(\"filename\",A1),FIND(\"]\",CELL(\"filename\",A1))+1,255)","v":"Матрица рисков"}]
[]
[]
[]
[]
[null,"Рейтинг вероятности",null,null,"Очень низкий","Низкий","Умеренный","Высокий","Очень высокий"]
[null,"Оценка рейтинга вероятности",null,null,"0 - 2","2 - 4","4 - 6","6 - 8","8 - 10"]
[null,"Серьезность\nОценка среднего уровня серьезности (основанная на ответах об уязвимости, воздействия и ответных мерах)","Незначительный","0 - 10","VL1","VL2","L3","L4","M5"]
[null,null,"Легкий","11 - 25","VL2","L3","L4","M5","M6"]
{"$rows_left_out":47}
{"sheet":"Информация","index":4,"n_rows":24,"n_cols":3,"rows_kept":24,"cut":false,"hidden":false,"merged":[]}
[{"$f":"MdlTle","v":"Инструмент быстрой оценки риска (БОР)"}]
[{"$f":"MID(CELL(\"filename\",A1),FIND(\"]\",CELL(\"filename\",A1))+1,255)","v":"Информация"}]
[]
[]
[]
[]
[]
[]
[]
[]
{"$rows_left_out":15}
{"sheet":"Предположения","index":5,"n_rows":162,"n_cols":6,"rows_kept":162,"cut":false,"hidden":false,"merged":[]}
[{"$f":"MdlTle","v":"Инструмент быстрой оценки риска (БОР)"}]
[{"$f":"MID(CELL(\"filename\",A1),FIND(\"]\",CELL(\"filename\",A1))+1,255)","v":"Предположения"}]
[]
[]
["Общие предположения"]
[]
[]
[null,"Пропорция оценки рейтинга вероятности",null,"%",null,0.5]
[null,"Максимальный балл/оценка",null,"#",null,10]
[null,"Уязвимость",null,"%",null,0.25]
{"$rows_left_out":153}
{"sheet":"Ввод данных об угрозах","index":6,"n_rows":54,"n_cols":14,"rows_kept":54,"cut":false,"hidden":false,"merged":[[4,1,5,1],[4,4,4,7],[4,2,5,2],[4,13,5,13],[4,3,5,3],[4,9,5,9],[4,12,5,12]]}
[{"$f":"MdlTle","v":"Инструмент быстрой оценки риска (БОР)"}]
[{"$f":"MID(CELL(\"filename\",A1),FIND(\"]\",CELL(\"filename\",A1))+1,255)","v":"Ввод данных об угрозах"}]
[]
[]
[null,"Группа угроз","Опасные события","Рейтинг вероятности","Оценка уязвимости",null,null,null,"Общая оценка уязвимости","Текущий уровень реагирования и предпринятые меры","Оценка рейтинга: Вероятность","Оценка рейтинга: Серьёзность","Результат матрицы рисков","Комментарии и обоснования"]
[null,null,null,null,"Инфраструктура","Производственные сектора","Основные или базовые услуги","Человеческие и социальные аспекты","1 (низкая) - 100 (высокая)",null,"1 (низкая) - 10 (высокая)","1 (низкий) - 100 (высокий)"]
[null,"H1 - Геофизические"]
[null,null,null,null,null,null,null,null,{"$f":"IFERROR((((INDEX(Предположения!$F$28:$F$38,MATCH(E8,Vulnerabilties,0))*Предположения!$F$10)+(INDEX(Предположения!$F$28:$F$38,MATCH(F8,Vulnerabilties,0))*Предположения!$F$10)+(INDEX(Предположения!$F$28:$F$38,MATCH(G8,Vulnerabilties,0))*Предположения!$F$10)+(INDEX(Предположения!$F$28:$F$38,MATCH(H8,Vulnerabilties,0))*Предположения!$F$10))*Предположения!$F$9),0)","v":0},null,{"$f":"IFERROR(INDEX(Предположения!$F$15:$F$25,MATCH(D8,Exposures,0)*Предположения!$F$8+(I8/Предположения!$F$9)*Предположения!$F$8),0)","v":0},{"$f":"IFERROR((K8*Предположения!$F$9)-(INDEX(Предположения!$F$41:$F$51,MATCH(J8,Levels_of_response,0))*Предположения!$F$9),0)","v":0},{"$f":"IF(L8=0,\"-\",IFERROR(INDEX('Матрица рисков'!$G$28:$G$53,MATCH(SUMPRODUCT(('Матрица рисков'!$B$28:$B$53<=L8)*('Матрица рисков'!$C$28:$C$53>=L8)*('Матрица рисков'!$D$28:$D$53<=K8)*('Матрица рисков'!$E$28:$E$53>=K8)*('Матрица рисков'!$F$28:$F$53)),'Матрица рисков'!$F$28:$F$53,0)),0))","v":"-"}]
[null,null,null,null,null,null,null,null,{"$f":"IFERROR((((INDEX(Предположения!$F$28:$F$38,MATCH(E9,Vulnerabilties,0))*Предположения!$F$10)+(INDEX(Предположения!$F$28:$F$38,MATCH(F9,Vulnerabilties,0))*Предположения!$F$10)+(INDEX(Предположения!$F$28:$F$38,MATCH(G9,Vulnerabilties,0))*Предположения!$F$10)+(INDEX(Предположения!$F$28:$F$38,MATCH(H9,Vulnerabilties,0))*Предположения!$F$10))*Предположения!$F$9),0)","v":0},null,{"$f":"IFERROR(INDEX(Предположения!$F$15:$F$25,MATCH(D9,Exposures,0)*Предположения!$F$8+(I9/Предположения!$F$9)*Предположения!$F$8),0)","v":0},{"$f":"IFERROR((K9*Предположения!$F$9)-(INDEX(Предположения!$F$41:$F$51,MATCH(J9,Levels_of_response,0))*Предположения!$F$9),0)","v":0},{"$f":"IF(L9=0,\"-\",IFERROR(INDEX('Матрица рисков'!$G$28:$G$53,MATCH(SUMPRODUCT(('Матрица рисков'!$B$28:$B$53<=L9)*('Матрица рисков'!$C$28:$C$53>=L9)*('Матрица рисков'!$D$28:$D$53<=K9)*('Матрица рисков'!$E$28:$E$53>=K9)*('Матрица рисков'!$F$28:$F$53)),'Матрица рисков'!$F$28:$F$53,0)),0))","v":"-"}]
[null,null,null,null,null,null,null,null,{"$f":"IFERROR((((INDEX(Предположения!$F$28:$F$38,MATCH(E10,Vulnerabilties,0))*Предположения!$F$10)+(INDEX(Предположения!$F$28:$F$38,MATCH(F10,Vulnerabilties,0))*Предположения!$F$10)+(INDEX(Предположения!$F$28:$F$38,MATCH(G10,Vulnerabilties,0))*Предположения!$F$10)+(INDEX(Предположения!$F$28:$F$38,MATCH(H10,Vulnerabilties,0))*Предположения!$F$10))*Предположения!$F$9),0)","v":0},null,{"$f":"IFERROR(INDEX(Предположения!$F$15:$F$25,MATCH(D10,Exposures,0)*Предположения!$F$8+(I10/Предположения!$F$9)*Предположения!$F$8),0)","v":0},{"$f":"IFERROR((K10*Предположения!$F$9)-(INDEX(Предположения!$F$41:$F$51,MATCH(J10,Levels_of_response,0))*Предположения!$F$9),0)","v":0},{"$f":"IF(L10=0,\"-\",IFERROR(INDEX('Матрица рисков'!$G$28:$G$53,MATCH(SUMPRODUCT(('Матрица рисков'!$B$28:$B$53<=L10)*('Матрица рисков'!$C$28:$C$53>=L10)*('Матрица рисков'!$D$28:$D$53<=K10)*('Матрица рисков'!$E$28:$E$53>=K10)*('Матрица рисков'!$F$28:$F$53)),'Матрица рисков'!$F$28:$F$53,0)),0))","v":"-"}]
{"$rows_left_out":45}
{"sheet":"Оценка данных","index":7,"n_rows":48,"n_cols":13,"rows_kept":48,"cut":false,"hidden":false,"merged":[[25,1,29,1],[30,1,34,1],[35,1,39,1],[40,1,44,1],[5,0,6,0],[5,1,9,1],[10,1,14,1],[15,1,19,1],[20,1,24,1]]}
[{"$f":"MdlTle","v":"Инструмент быстрой оценки риска (БОР)"}]
[{"$f":"MID(CELL(\"filename\",A1),FIND(\"]\",CELL(\"filename\",A1))+1,255)","v":"Оценка данных"}]
[]
[]
[null,"Группа угроз","Бедствие","Опасное событие","Рейтинг вероятности (1-10)",{"$f":"'Ввод данных об угрозах'!E6","v":"Инфраструктура"},{"$f":"'Ввод данных об угрозах'!F6","v":"Производственные сектора"},{"$f":"'Ввод данных об угрозах'!G6","v":"Основные или базовые услуги"},{"$f":"'Ввод данных об угрозах'!H6","v":"Человеческие и социальные аспекты"},"Общая оценка уязвимости\n(1-100)","Текущий уровень действий      (1-10)","Оценка рейтинга: Вероятность \n(1-10)","Оценка рейтинга: Серьезность \n(1-100)"]
[null,{"$f":"'Ввод данных об угрозах'!$B$7","v":"H1 - Геофизические"},{"$f":"'Ввод данных об угрозах'!B8","v":0},{"$f":"'Ввод данных об угрозах'!C8","v":0},{"$f":"IFERROR(INDEX(Предположения!$F$15:$F$25,MATCH('Ввод данных об угрозах'!D8,Exposures,0)),0)","v":0},{"$f":"IFERROR(INDEX(Предположения!$F$15:$F$25,MATCH('Ввод данных об угрозах'!E8,Exposures,0)),0)","v":0},{"$f":"IFERROR(INDEX(Предположения!$F$15:$F$25,MATCH('Ввод данных об угрозах'!F8,Exposures,0)),0)","v":0},{"$f":"IFERROR(INDEX(Предположения!$F$15:$F$25,MATCH('Ввод данных об угрозах'!G8,Exposures,0)),0)","v":0},{"$f":"IFERROR(INDEX(Предположения!$F$15:$F$25,MATCH('Ввод данных об угрозах'!H8,Exposures,0)),0)","v":0},{"$f":"'Ввод данных об угрозах'!I8","v":0},{"$f":"IFERROR(INDEX(Предположения!$F$41:$F$51,MATCH('Ввод данных об угрозах'!J8,Levels_of_response,0)),0)","v":0},{"$f":"'Ввод данных об угрозах'!K8","v":0},{"$f":"'Ввод данных об угрозах'!L8","v":0}]
[null,null,{"$f":"'Ввод данных об угрозах'!B9","v":0},{"$f":"'Ввод данных об угрозах'!C9","v":0},{"$f":"IFERROR(INDEX(Предположения!$F$15:$F$25,MATCH('Ввод данных об угрозах'!D9,Exposures,0)),0)","v":0},{"$f":"IFERROR(INDEX(Предположения!$F$15:$F$25,MATCH('Ввод данных об угрозах'!E9,Exposures,0)),0)","v":0},{"$f":"IFERROR(INDEX(Предположения!$F$15:$F$25,MATCH('Ввод данных об угрозах'!F9,Exposures,0)),0)","v":0},{"$f":"IFERROR(INDEX(Предположения!$F$15:$F$25,MATCH('Ввод данных об угрозах'!G9,Exposures,0)),0)","v":0},{"$f":"IFERROR(INDEX(Предположения!$F$15:$F$25,MATCH('Ввод данных об угрозах'!H9,Exposures,0)),0)","v":0},{"$f":"'Ввод данных об угрозах'!I9","v":0},{"$f":"IFERROR(INDEX(Предположения!$F$41:$F$51,MATCH('Ввод данных об угрозах'!J9,Levels_of_response,0)),0)","v":0},{"$f":"'Ввод данных об угрозах'!K9","v":0},{"$f":"'Ввод данных об угрозах'!L9","v":0}]
[null,null,{"$f":"'Ввод данных об угрозах'!B10","v":0},{"$f":"'Ввод данных об угрозах'!C10","v":0},{"$f":"IFERROR(INDEX(Предположения!$F$15:$F$25,MATCH('Ввод данных об угрозах'!D10,Exposures,0)),0)","v":0},{"$f":"IFERROR(INDEX(Предположения!$F$15:$F$25,MATCH('Ввод данных об угрозах'!E10,Exposures,0)),0)","v":0},{"$f":"IFERROR(INDEX(Предположения!$F$15:$F$25,MATCH('Ввод данных об угрозах'!F10,Exposures,0)),0)","v":0},{"$f":"IFERROR(INDEX(Предположения!$F$15:$F$25,MATCH('Ввод данных об угрозах'!G10,Exposures,0)),0)","v":0},{"$f":"IFERROR(INDEX(Предположения!$F$15:$F$25,MATCH('Ввод данных об угрозах'!H10,Exposures,0)),0)","v":0},{"$f":"'Ввод данных об угрозах'!I10","v":0},{"$f":"IFERROR(INDEX(Предположения!$F$41:$F$51,MATCH('Ввод данных об угрозах'!J10,Levels_of_response,0)),0)","v":0},{"$f":"'Ввод данных об угрозах'!K10","v":0},{"$f":"'Ввод данных об угрозах'!L10","v":0}]
[null,null,{"$f":"'Ввод данных об угрозах'!B11","v":0},{"$f":"'Ввод данных об угрозах'!C11","v":0},{"$f":"IFERROR(INDEX(Предположения!$F$15:$F$25,MATCH('Ввод данных об угрозах'!D11,Exposures,0)),0)","v":0},{"$f":"IFERROR(INDEX(Предположения!$F$15:$F$25,MATCH('Ввод данных об угрозах'!E11,Exposures,0)),0)","v":0},{"$f":"IFERROR(INDEX(Предположения!$F$15:$F$25,MATCH('Ввод данных об угрозах'!F11,Exposures,0)),0)","v":0},{"$f":"IFERROR(INDEX(Предположения!$F$15:$F$25,MATCH('Ввод данных об угрозах'!G11,Exposures,0)),0)","v":0},{"$f":"IFERROR(INDEX(Предположения!$F$15:$F$25,MATCH('Ввод данных об угрозах'!H11,Exposures,0)),0)","v":0},{"$f":"'Ввод данных об угрозах'!I11","v":0},{"$f":"IFERROR(INDEX(Предположения!$F$41:$F$51,MATCH('Ввод данных об угрозах'!J11,Levels_of_response,0)),0)","v":0},{"$f":"'Ввод данных об угрозах'!K11","v":0},{"$f":"'Ввод данных об угрозах'!L11","v":0}]
[null,null,{"$f":"'Ввод данных об угрозах'!B12","v":0},{"$f":"'Ввод данных об угрозах'!C12","v":0},{"$f":"IFERROR(INDEX(Предположения!$F$15:$F$25,MATCH('Ввод данных об угрозах'!D12,Exposures,0)),0)","v":0},{"$f":"IFERROR(INDEX(Предположения!$F$15:$F$25,MATCH('Ввод данных об угрозах'!E12,Exposures,0)),0)","v":0},{"$f":"IFERROR(INDEX(Предположения!$F$15:$F$25,MATCH('Ввод данных об угрозах'!F12,Exposures,0)),0)","v":0},{"$f":"IFERROR(INDEX(Предположения!$F$15:$F$25,MATCH('Ввод данных об угрозах'!G12,Exposures,0)),0)","v":0},{"$f":"IFERROR(INDEX(Предположения!$F$15:$F$25,MATCH('Ввод данных об угрозах'!H12,Exposures,0)),0)","v":0},{"$f":"'Ввод данных об угрозах'!I12","v":0},{"$f":"IFERROR(INDEX(Предположения!$F$41:$F$51,MATCH('Ввод данных об угрозах'!J12,Levels_of_response,0)),0)","v":0},{"$f":"'Ввод данных об угрозах'!K12","v":0},{"$f":"'Ввод данных об угрозах'!L12","v":0}]
{"$rows_left_out":39}
{"sheet":"Отчет о рисках","index":8,"n_rows":9,"n_cols":3,"rows_kept":9,"cut":false,"hidden":false,"merged":[]}
[null,{"$f":"MdlTle","v":"Инструмент быстрой оценки риска (БОР)"}]
[null,{"$f":"MID(CELL(\"filename\",B1),FIND(\"]\",CELL(\"filename\",B1))+1,255)","v":"Отчет о рисках"}]
[]
[]
[null,{"$f":"Информация!C15","v":"Местоположение/Регион/Название:"},{"$f":"Информация!$L$15","v":0}]
[null,{"$f":"Информация!C17","v":"Описание (включая исследуемый (е) объект (ы)): "},{"$f":"Информация!$L$17","v":0}]
[null,{"$f":"Информация!C20","v":"Эксперт (т.е. лицо, выполняющее данную оценку риска): "},{"$f":"Информация!$L$20","v":0}]
[null,{"$f":"Информация!C22","v":"Дата завершения: "},{"$f":"TEXT(Информация!$L$22,\"DD MMM YYYY\")","v":"00 Jan 1900"}]
[null,{"$f":"Информация!C24","v":"Дата обзора/версия: "},{"$f":"TEXT(Информация!$L$24, \"DD MMM YYYY\")","v":"00 Jan 1900"}]

{"sheet":"Отчет об уязвимости","index":9,"n_rows":55,"n_cols":3,"rows_kept":55,"cut":false,"hidden":false,"merged":[]}
[null,{"$f":"MdlTle","v":"Инструмент быстрой оценки риска (БОР)"}]
[null,{"$f":"MID(CELL(\"filename\",B1),FIND(\"]\",CELL(\"filename\",B1))+1,255)","v":"Отчет об уязвимости"}]
[]
[]
[null,{"$f":"Информация!C15","v":"Местоположение/Регион/Название:"},{"$f":"Информация!$L$15","v":0}]
[null,{"$f":"Информация!C17","v":"Описание (включая исследуемый (е) объект (ы)): "},{"$f":"Информация!$L$17","v":0}]
[null,{"$f":"Информация!C20","v":"Эксперт (т.е. лицо, выполняющее данную оценку риска): "},{"$f":"Информация!$L$20","v":0}]
[null,{"$f":"Информация!C22","v":"Дата завершения: "},{"$f":"TEXT(Информация!$L$22,\"DD MMM YYYY\")","v":"00 Jan 1900"}]
[null,{"$f":"Информация!C24","v":"Дата обзора/версия: "},{"$f":"TEXT(Информация!$L$24, \"DD MMM YYYY\")","v":"00 Jan 1900"}]
[]
{"$rows_left_out":46}
{"sheet":"Контакты","index":10,"n_rows":9,"n_cols":1,"rows_kept":9,"cut":false,"hidden":false,"merged":[[6,0,6,2]]}
[{"$f":"MdlTle","v":"Инструмент быстрой оценки риска (БОР)"}]
[{"$f":"MID(CELL(\"filename\",A1),FIND(\"]\",CELL(\"filename\",A1))+1,255)","v":"Контакты"}]
[]
[]
[]
["Questions?\n\n"]
["Пожалуйста свяжитесь с нашим персоналом и партнерами в ближайшем к вам регионе:"]
[]
["https://www.unisdr.org/campaign/resilientcities/about/article/about-the-campaign"]